{"text_format":"1","workbook":"xlsx","n_sheets":7,"sheets":["Paramètres","Nrj","Schema","Air humide","Démo1","Démo2","Densité"],"not_rendered":{"charts":0,"images":2,"macros":1,"external_links":0,"defined_names":21,"comments":2,"pivot_tables":0},"unopened":[],"bounds":{"document_bytes":16777216,"sheet_cells":100000,"rows_first":2000,"rows_last":500,"rows_between":2000,"halvings":0,"cell_chars":16384,"cell_head_chars":4096},"cells_cut":0,"cells_raw":0,"read":"whole","date_system":"1900"}

{"sheet":"Paramètres","index":0,"n_rows":107,"n_cols":20,"rows_kept":107,"cut":false,"hidden":false,"merged":[[8,3,8,4],[8,6,8,7],[8,9,8,12]]}
[]
[null,"Règlage des paramètres de fonctionnement tour de séchage MSD"]
[]
[null,"Produit fabriqué :","Lait 14%",null,null,"Concentré traité :",null,{"$f":"H5/C5%","v":0},null,"kg / h",{"$f":"H4/((VLOOKUP(Paramètres!C5,Densité!A2:B286,2))-(VLOOKUP(M4,Densité!D2:E75,2)))","v":0},"ltrs / h",{"$f":"Nrj!C47","v":60},null,"Nb buses",null,null,null,3]
[null,"Extrait sec entrant :",49,"%",null,"Extrait sec traité :",null,{"$f":"H6*C6/100","v":0},null,"kg / h",null,null,null,null,"P",null,null,null,{"$f":"L7","v":220},"bars"]
[null,"Extrait sec poudre :",96.2,"%",null,"Poudre produite :",null,{"$f":"H32*((C5/(C6-C5)))","v":0},null,"kg / h",null,null,null,null,"f",null,null,null,0.9]
[null,"Buse",40,"Pointeau",null,640,null,"Homo.",null,"60/20","P. buses",220,null,null,"A",null,null,null,{"$f":"((K4/1000)/((SQRT(S5))*S6*S4))*1000","v":0}]
[null,null,null,null,null,null,null,null,null,null,null,null,null,null,"Débit buse au prod",null,null,null,{"$f":"3150/3","v":1050}]
[null,"Paramètres","T°c","Volume",null,"Poids","W",null,null,"Enthalpie",null,null,null,null,"Débit buse à l'eau",null,null,null,{"$f":"IF(S11=0,0,(S8)/(1/S11))","v":0}]
[]
[null,null,null,"m3/kgas","total","kg as","kg/kgas","total",null,"kj/kgas","kcal/kgas","total kj","total kcal",null,"Densité",null,null,null,{"$f":"IF(H4=0,0,H4/K4)","v":0}]
[]
[]
[null,"Caractéristiques de l'air ",null,null,null,null,null,null,null,null,null,null,null,null,"Pression 2",null,null,null,180]
[null,"ambiant entrée bâtiment",20,{"$f":"((22.41/273)*(C15+273))*((1/29)+((1/18)*G15))","v":0.8387244353921941},{"$f":"D15*F15","v":35253.227744601405},{"$f":"F52+F57+F59","v":42031.955022410577},7.0000000000000001E-3,{"$f":"F15*G15","v":294.22368515687407},null,{"$f":"(((1.005+(1.88*G15))*C15)+(2487*G15))","v":37.772199999999998},{"$f":"J15/4.1855","v":9.0245370923426105},{"$f":"F15*J15","v":1587639.4114974968},{"$f":"L15/4.1855","v":379318.93716342055},null,"Débit 2",null,null,null,{"$f":"S9*S6*SQRT(S14/S5)","v":0}]
[]
[]
[null,"Air amont avant chauffage",{"$f":"IF(Nrj!C10=\"non\",C15+5,IF(C21<80,C15+5,Nrj!C14))","v":25},{"$f":"((22.41/273)*(C18+273))*((1/29)+((1/18)*G18))","v":0.85303713906782874},{"$f":"D18*F18","v":23032.002754831377},27000,{"$f":"G15","v":7.0000000000000001E-3},{"$f":"F18*G18","v":189},null,{"$f":"(((1.005+(1.88*G18))*C18)+(2487*G18))","v":42.863},{"$f":"J18/4.1855","v":10.24083144188269},{"$f":"F18*J18","v":1157301},{"$f":"L18/4.1855","v":276502.44893083262},null,null,"2 buses",null,null,{"$f":"S15*2","v":0}]
[null,"Air amont sortie batterie vapeur",{"$f":"IF(C21<140,C21,140)","v":71},{"$f":"((22.41/273)*(C19+273))*((1/29)+((1/18)*G19))","v":0.98471401288366811},{"$f":"D19*F19","v":26587.278347859039},{"$f":"F18","v":27000},{"$f":"G15","v":7.0000000000000001E-3},{"$f":"F19*G19","v":189},null,{"$f":"(((1.005+(1.88*G19))*C19)+(2487*G19))","v":89.698360000000008},{"$f":"J19/4.1855","v":21.430739457651416},{"$f":"F19*J19","v":2421855.7200000002},{"$f":"L19/4.1855","v":578629.96535658825}]
[]
{"$rows_left_out":88}
{"sheet":"Nrj","index":1,"n_rows":99,"n_cols":18,"rows_kept":99,"cut":false,"hidden":false,"merged":[[6,3,6,4],[6,6,6,7],[6,13,6,14],[86,3,86,4],[86,6,86,7]]}
[]
[null,"Bilan énergie  tour de séchage MSD "]
[]
[]
[]
[]
[null,null,"T°c","Volume",null,"Poids","W",null,null,null,"Enthalpie",null,null,"Ratios"]
[]
[null,null,null,"m3/kgas","total","kg","kg/kgas","total",null,"kj/kgas","kcal/kgas","total kj","total kcal"," /kgee"," /kg prod"]
[null,"Cogénération","non"]
[]
[null,"Air amont après gaz",{"$f":"Paramètres!C21","v":71},{"$f":"((22.41/273)*(C12+273))*((1/29)+((1/18)*G12))","v":0.98471401288366811},{"$f":"D12*F12","v":26587.278347859039},{"$f":"Paramètres!F21","v":27000},{"$f":"Paramètres!G23","v":7.0000000000000001E-3},{"$f":"F12*G12","v":189},null,{"$f":"(((1.005+(1.88*G12))*C12)+(2487*G12))","v":89.698360000000008},{"$f":"J12/4.1855","v":21.430739457651416},{"$f":"F12*J12","v":2421855.7200000002},{"$f":"L12/4.1855","v":578629.96535658825},null,null,{"$f":"M12-M13","v":0}]
[null,"Air amont après vapeur",{"$f":"Paramètres!C19","v":71},{"$f":"((22.41/273)*(C13+273))*((1/29)+((1/18)*G13))","v":0.98471401288366811},{"$f":"D13*F13","v":26587.278347859039},{"$f":"Paramètres!F22","v":27000},{"$f":"Paramètres!G19","v":7.0000000000000001E-3},{"$f":"F13*G13","v":189},null,{"$f":"(((1.005+(1.88*G13))*C13)+(2487*G13))","v":89.698360000000008},{"$f":"J13/4.1855","v":21.430739457651416},{"$f":"F13*J13","v":2421855.7200000002},{"$f":"L13/4.1855","v":578629.96535658825}]
[null,"Air amont après filtre",{"$f":"IF(C10=\"oui\",45,Paramètres!C18)","v":25},{"$f":"((22.41/273)*(C14+273))*((1/29)+((1/18)*G14))","v":0.85303713906782874},{"$f":"D14*F14","v":23032.002754831377},{"$f":"F12","v":27000},{"$f":"Paramètres!G18","v":7.0000000000000001E-3},{"$f":"F14*G14","v":189},null,{"$f":"(((1.005+(1.88*G14))*C14)+(2487*G14))","v":42.863},{"$f":"J14/4.1855","v":10.24083144188269},{"$f":"F14*J14","v":1157301},{"$f":"L14/4.1855","v":276502.44893083262}]
[]
[null,"Energie consommée",null,null,null,null,null,null,null,null,null,{"$f":"L12-L14-L15","v":1264554.7200000002},{"$f":"M12-M14","v":302127.51642575563}]
[]
[null,"Air amont LS",{"$f":"Paramètres!C25","v":90},{"$f":"((22.41/273)*(C18+273))*((1/29)+((1/18)*G18))","v":1.03910228685108},{"$f":"D18*F18","v":8346.0228316718458},{"$f":"Paramètres!F47","v":8031.9550224105742},{"$f":"G14","v":7.0000000000000001E-3},{"$f":"F18*G18","v":56.223685156874019},null,{"$f":"(((1.005+(1.88*G18))*C18)+(2487*G18))","v":109.04339999999999},{"$f":"J18/4.1855","v":26.052657985903711},{"$f":"F18*J18","v":875831.68429072516},{"$f":"L18/4.1855","v":209253.77715702428}]
[null,"Air amont LS",{"$f":"Paramètres!C18","v":25},{"$f":"((22.41/273)*(C19+273))*((1/29)+((1/18)*G19))","v":0.85303713906782874},{"$f":"D19*F19","v":6851.5559334385944},{"$f":"F18","v":8031.9550224105742},{"$f":"G14","v":7.0000000000000001E-3},{"$f":"F19*G19","v":56.223685156874019},null,{"$f":"(((1.005+(1.88*G19))*C19)+(2487*G19))","v":42.863},{"$f":"J19/4.1855","v":10.24083144188269},{"$f":"F19*J19","v":344273.68812558445},{"$f":"L19/4.1855","v":82253.897533289797}]
[null,"Energie consommée",null,null,null,null,null,null,null,null,null,{"$f":"L18-L19","v":531557.99616514076},{"$f":"M18-M19","v":126999.87962373448}]
{"$rows_left_out":80}
{"sheet":"Schema","index":2,"n_rows":48,"n_cols":95,"rows_kept":48,"cut":false,"hidden":false,"merged":[]}
["Tour 1 MSD",null,null,null,null,null,null,null,null,null,null,null,null,null,null,null,null,null,null,null,null,null,null,null,null,null,null,null,null,null,null,null,null,null,null,null,null,null,null,null,null,null,null,null,null,null,null,null,null,null,null,null,null,null,null,null,null,null,null,null,null,null,null,null,null,null,null,null,null,null,null,null,null,null,null,null,null,"Observations"]
[null,null,null,null,null,null,null,null,null,null,null,null,null,null,null,null,null,null,null,null,null,null,null,null,null,null,null,null,null,null,null,null,null,null,null,null,null,null,"Evaporation"]
[null,null,null,null,null,null,null,null,null,null,null,null,null,null,null,null,null,null,null,null,null,null,null,null,null,null,null,null,null,null,null,null,null,null,null,null,null,null,"Kg / h :",null,null,{"$f":"Paramètres!H32","v":0},null,null,null,null,null,null,null,null,null,null,null,null,null,null,null,null,null,null,null,null,null,null,null,null,null,null,null,null,null,null,null,null,null,null,null,"le :                                          ",null,{"$f":"NOW()","v":"2023-08-03T11:37:48.380"}]
[null,"Concentré ",null,null,null,null,null,"ES %",null,{"$f":"Paramètres!C5","v":49},null,null,null,null,null,null,null,null,null,null,"T°C :",{"$f":"Paramètres!C37","v":40}]
[null,"PB :",{"$f":"Paramètres!H4","v":0},null,null,"kg",null,"PHP :",null,220,null,"b",null,null,null,null,null,null,null,null,null,null,null,null,null,null,null,null,null,"Air sortant ",null,null,null,null,null,null,null,null,null,null,null,null,null,null,null,null,null,null,null,null,null,null,null,null,null,null,null,null,null,null,null,null,null,null,null,null,null,null,null,null,null,null,null,null,null,null,null,"Production :",null,null,null,null,null,{"$f":"Paramètres!C4","v":"Lait 14%"}]
[null,"MS :",{"$f":"Paramètres!H5","v":0},null,null,"kg",null,"PH1 :",null,100,null,"b",null,null,null,null,null,null,null,null,null,null,null,null,null,null,null,null,null,"T°C :",null,null,{"$f":"Paramètres!C52","v":72.567291121129003}]
[null,"T°C :",{"$f":"Paramètres!M4","v":60},null,null,null,null,"PH2 :",null,60,null,"b",null,null,null,null,null,null,null,null,null,null,null,null,null,null,null,null,null,"HR % :",null,null,{"$f":"Paramètres!E83","v":3.1935914236662541},null,null,null,null,null,null,null,null,null,null,null,null,null,"Delta p :",null,null,null,{"$f":"Paramètres!E85","v":198.56273636028473},null,null,null,null,null,null,null,null,null,null,null,null,null,null,null,null,null,null,null,null,null,null,null,null,null,null,"Heures fab. :",null,null,null,null,null,null,null,null,null,20]
[null,null,null,null,null,null,null,null,null,null,null,null,null,null,null,null,null,null,null,null,null,null,null,null,null,null,null,null,null,null,null,null,null,null,null,null,null,null,null,null,null,null,null,null,null,null,null,null,null,null,null,null,null,null,null,null,null,null,null,null,null,null,null,null,null,null,null,null,null,null,null,null,null,null,null,null,null,"Mise en chauffe :",null,null,null,null,null,null,null,null,null,1]
[null,null,null,null,null,null,null,null,null,null,null,null,null,null,null,null,null,null,null,null,null,null,null,null,null,null,null,null,null,null,null,null,null,null,null,null,null,null,null,null,null,null,null,null,null,null,null,null,null,null,null,null,null,null,null,null,null,null,null,null,null,null,null,null,null,null,null,null,null,null,null,null,null,null,null,null,null,"Temps de nettoyage :",null,null,null,null,null,null,null,null,null,3]
[null,null,null,null,null,null,null,null,null,null,null,null,null,null,null,null,null,null,null,null,null,null,null,null,null,null,null,null,null,null,null,null,null,null,null,null,null,null,null,null,null,null,null,null,null,null,null,null,null,null,null,null,null,null,null,null,null,null,null,null,null,null,null,null,null,null,null,null,null,null,null,null,null,null,null,null,null,"HF / HM :",null,null,null,null,null,null,null,null,null,{"$f":"CJ7/(CJ7+CJ8)","v":0.95238095238095233}]
[]
[null,null,null,null,null,null,null,null,null,null,null,null,null,null,null,null,null,null,null,null,null,null,null,null,null,null,null,null,null,null,null,null,null,null,null,null,null,null,null,null,null,null,null,null,null,null,null,null,null,null,null,null,null,null,null,null,null,null,null,null,null,null,null,null,null,null,null,null,null,null,null,null,null,null,null,null,null,"Consommations d'énergie :"]
[null,"Air filtres amont ",null,null,null,null,null,null,null,"Air amont ",null,null,null,null,null,null,null,null,null,null,null,null,null,null,null,null,null,null,null,null,null,null,null,null,null,null,null,null,null,null,null,null,null,null,null,null,null,null,null,null,null,null,null,null,null,null,null,null,null,null,null,null,null,null,null,null,null,null,null,null,null,null,null,null,null,null,null,"Vapeur kg :",null,null,null,null,null,null,null,null,null,{"$f":"Nrj!M62","v":831.3552473990477}]
[null,"T°C",null,null,{"$f":"Paramètres!C18","v":25},null,null,null,null,"T°C cogé :",null,null,{"$f":"Paramètres!C18","v":25},null,null,null,null,null,null,null,null,null,null,null,null,null,null,null,null,null,null,null,null,null,null,null,null,null,null,null,null,null,null,null,null,null,null,null,null,null,null,null,null,null,null,null,null,null,null,null,null,null,null,null,"Adjonction ",null,null,null,null,null,null,null,null,null,null,null,null,"Gaz brul. m3  :",null,null,null,null,null,null,null,null,null,{"$f":"Nrj!M66","v":0}]
[null,null,null,null,null,null,null,null,null,"T°C Vap : ",null,{"$f":"Paramètres!C19","v":71},null,null,null,null,null,null,null,null,null,null,null,null,null,null,null,null,null,null,null,null,null,null,null,null,null,null,null,null,null,null,null,null,null,null,null,null,null,null,null,null,null,null,null,null,null,null,null,null,null,null,null,null,"Qualité :",null,null,null,null,null,null,null,null,null,null,null,null,"Tot Gaz m3  :",null,null,null,null,null,null,null,null,null,{"$f":"Nrj!M69","v":65.615598991964774}]
[null,null,null,null,null,null,null,null,null,"T°C Gaz : ",null,{"$f":"Paramètres!C23","v":71},null,null,null,null,null,null,null,null,null,null,null,null,null,null,null,null,null,null,null,null,null,null,null,null,null,null,null,null,null,null,null,null,null,null,null,null,null,null,null,null,null,null,null,null,null,null,null,null,null,null,null,null,"Kg / h :",null,null,null,null,null,null,null,null,null,null,null,null,"Kwh élec :",null,null,null,null,null,null,null,null,null,{"$f":"Nrj!M73","v":215}]
[null,null,null,null,null,null,null,null,null,"w 1 :",null,null,{"$f":"Paramètres!G21","v":7.0000000000000001E-3}]
[null,null,null,null,null,null,null,null,null,"w 2 :",null,null,{"$f":"Paramètres!G23","v":7.0000000000000001E-3},null,null,null,null,null,null,null,null,null,null,null,null,null,null,null,null,null,null,null,null,null,null,null,null,null,null,null,null,null,null,null,null,null,null,null,null,null,null,null,null,null,null,null,null,null,null,null,null,null,null,null,"Réincorporation",null,null,null,null,null,null,null,null,null,null,null,null,"Ratios (HM comprises) :"]
[null,null,null,null,null,null,null,null,null,null,null,null,null,null,null,null,null,null,null,null,null,null,null,null,null,null,null,null,null,null,null,null,null,null,null,null,null,null,null,null,null,null,null,null,null,null,null,null,null,null,null,null,null,null,null,null,null,null,null,null,null,null,null,null,"Qualité :",null,null,null,null,null,null,null,null,null,null,null,null,"Vapeur t / t de poudre :",null,null,null,null,null,null,null,null,null,{"$f":"Nrj!O62","v":{"$error":"#DIV/0!"}}]
[null,null,null,null,null,null,null,null,null,null,null,null,null,null,null,null,null,null,null,null,null,null,null,null,null,null,null,null,null,null,null,null,null,null,null,null,null,null,null,null,null,null,null,null,null,null,null,null,null,null,null,null,null,null,null,null,null,null,null,null,null,null,null,null,"Poids kg :",null,null,null,null,null,null,null,null,null,null,null,null,"Gaz kw pcs / t de poudre :",null,null,null,null,null,null,null,null,null,{"$f":"(Nrj!O71*1000)/CJ10","v":{"$error":"#DIV/0!"}}]
{"$rows_left_out":29}
{"sheet":"Air humide","index":3,"n_rows":722,"n_cols":14,"rows_kept":722,"cut":false,"hidden":true,"merged":[]}
["T°c humide","T°c de rosée","Pv sat.Pe en Pa","P air sec Pa","ws gr/ kg as",null,"T°c humide","H kj / kg","ws kg/ kg as","v m3 / kg","T°c humide",null,null,"P atm Pa"]
[0,{"$f":"A2-0.1","v":-0.1},{"$f":"611.14*EXP(17.269*(((273.16+A2)-273.16)/((273.16+A2)-35.86)))","v":611.14},{"$f":"$N$2-C2","v":100713.86},{"$f":"I2*1000","v":3.7663959643892997},null,0,{"$f":"(((1.005+(1.88*(E2/1000)))*A2)+(2487*(E2/1000)))","v":9.3670267634361881},{"$f":"(18/29)*(C2/($N$2-C2))","v":3.7663959643892998E-3},{"$f":"((22.41/273)*(A2+273))*((1/28.96)+((1/18.1)*I2))","v":0.77848922284872735},0,null,null,101325]
[0.5,0.4,{"$f":"611.14*EXP(17.269*(((273.16+A3)-273.16)/((273.16+A3)-35.86)))","v":633.73823447394739},{"$f":"$N$2-C3","v":100691.26176552605},{"$f":"I3*1000","v":3.9065432226005008},null,0.5,{"$f":"(((1.005+(1.88*(E3/1000)))*A3)+(2487*(E3/1000)))","v":10.221745145236689},{"$f":"(18/29)*(C3/($N$2-C3))","v":3.9065432226005007E-3},{"$f":"((22.41/273)*(A3+273))*((1/28.96)+((1/18.1)*I3))","v":0.7800888644273074},0.5]
[1,0.9,{"$f":"611.14*EXP(17.269*(((273.16+A4)-273.16)/((273.16+A4)-35.86)))","v":657.07196185169926},100667.9280381483,4.0513178067064404,null,1,11.088243862755522,{"$f":"(18/29)*(C4/($N$2-C4))","v":4.05131780670644E-3},0.78169489178581186,1]
[1.5,1.4,681.16167322142337,100643.83832677858,4.2008533368502974,null,1.5,11.966868655156608,4.2008533368502977E-3,0.78330750275029559,1.5]
[2,1.9,706.02832654109068,100618.97167345892,4.3552867938754742,null,2,12.857974134713276,4.3552867938754739E-3,0.78492690055025127,2]
[2.5,2.4,731.69335459137551,100593.30664540862,4.5147585967539774,null,2.5,13.761923995531887,4.5147585967539776E-3,0.78655329395345819,2.5]
[3,2.9,758.1786730067455,100566.82132699326,4.6794126820166539,null,3,14.679091227701992,4.6794126820166541E-3,0.78818689740438808,3]
[3.5,3.4,785.50668838452327,100539.49331161547,4.8493965852589636,null,3.5,15.609858337070046,4.8493965852589634E-3,0.78982793116629602,3.5]
[4,3.9,813.7003064716929,100511.2996935283,5.0248615247995039,null,4,16.554617570842858,5.0248615247995036E-3,0.79147662146712405,4]
[4.5,4.4000000000000004,842.78294042920345,100482.2170595708,5.2059624875720232,null,4.5,17.513771149236479,5.2059624875720233E-3,0.79313320064935366,4.5]
[5,4.9000000000000004,872.77851917350927,100452.2214808265,5.392858317335425,null,5,18.487731503396155,5.3928583173354248E-3,0.79479790732394995,5]
[5.5,5.4,903.71149579507028,100421.28850420493,5.5857118052901793,null,5.5,19.476921519823378,5.5857118052901793E-3,0.7964709865285452,5.5]
[6,5.9,935.60685605351853,100389.39314394648,5.7846897831937172,null,6,20.4817747915572,5.7846897831937173E-3,0.79815268989001742,6]
[6.5,6.4,968.49012694918486,100356.50987305082,5.9899632190716652,null,6.5,21.502735876368284,5.9899632190716654E-3,0.79984327579162606,6.5]
[7,6.9,1002.3873853706591,100322.61261462934,6.2017073156263187,null,7,22.540260562236295,6.2017073156263184E-3,0.80154300954487523,7]
[7.5,7.4,1037.3252668180478,100287.67473318195,6.4201016114485174,null,7.5,23.594816140393888,6.4201016114485178E-3,0.80325216356628293,7.5]
[8,7.9,1073.3309742015704,100251.66902579843,6.6453300851440646,null,8,24.666881686233854,6.645330085144065E-3,0.80497101755923961,8]
[8.5,8.4,1110.4322867151302,100214.56771328487,6.8775812624910557,null,8.5,25.756948348389862,6.8775812624910556E-3,0.80669985870115524,8.5]
[9,8.9,1148.6575687844665,100176.34243121554,7.1170483267499609,null,9,26.865519646315761,7.1170483267499612E-3,0.80843898183609497,9]
{"$rows_left_out":703}
{"sheet":"Démo1","index":4,"n_rows":0,"n_cols":0,"rows_kept":0,"cut":false,"hidden":true,"merged":[]}

{"sheet":"Démo2","index":5,"n_rows":0,"n_cols":0,"rows_kept":0,"cut":false,"hidden":true,"merged":[]}

{"sheet":"Densité","index":6,"n_rows":291,"n_cols":8,"rows_kept":291,"cut":false,"hidden":true,"merged":[]}
["Densité",null,null,"Corrections à soustraire pour température"]
[5,{"$f":"-((A2*A2)/2000)+((108/8000)*A2)+0.957","v":1.012},"A2 B286",20,0,null,null,"D2 E74"]
[5.2,1.0136799999999999,null,27,5.0000000000000001E-3]
[5.4,1.01532,null,28,5.0000000000000001E-3]
[5.6,1.01692,null,29,5.0000000000000001E-3]
[5.8,1.0184800000000001,null,30,5.0000000000000001E-3]
[6,1.02,null,31,5.0000000000000001E-3]
[6.2,1.0214799999999999,null,32,5.0000000000000001E-3]
[6.4,1.0229200000000001,null,33,5.0000000000000001E-3]
[6.6,1.0243199999999999,null,34,5.0000000000000001E-3]
[6.8,1.0256799999999999,null,35,5.0000000000000001E-3]
[7,1.0269999999999999,null,36,5.0000000000000001E-3]
[7.2,1.0282799999999999,null,37,5.0000000000000001E-3]
[7.4,1.02952,null,38,5.0000000000000001E-3]
[7.6,1.0307199999999999,null,39,5.0000000000000001E-3]
[7.8,1.0318799999999999,null,40,5.0000000000000001E-3]
[8,1.0329999999999999,null,41,5.0000000000000001E-3]
[8.1999999999999993,1.0340799999999999,null,42,5.0000000000000001E-3]
[8.4,1.03512,null,43,5.0000000000000001E-3]
[8.6,1.0361199999999999,null,44,0.01]
{"$rows_left_out":271}